BDBM335603 5-((4-aminopiperidin-1-yl)methyl)-N-(3-fluoro-5-(5-isopropyl-1,2,4-oxadiazol-3-yl)phenyl)pyrrolo[1,2-f][1,2,4]triazin-4-amine::US9737542, Example 46
SMILES CC(C)c1nc(no1)-c1cc(F)cc(Nc2ncnn3ccc(CN4CCC(N)CC4)c23)c1
InChI Key InChIKey=HFKGAXJTEDNPQW-UHFFFAOYSA-N
Data  1 IC50
  Tab Delimited (TSV)   2D SDfile   Computed 3D by Vconf -m prep SDfile
Find this compound or compounds like it in BindingDB:
Activity Spreadsheet -- Enzyme Inhibition Constant Data from BindingDB
Found 1 hit for monomerid = 335603
TargetAP2-associated protein kinase 1(Homo sapiens (Human))
Bristol-Myers Squibb
US Patent
LigandPNGBDBM335603(5-((4-aminopiperidin-1-yl)methyl)-N-(3-fluoro-5-(5...)
Affinity DataIC50:  55nM. Assay description: The assays were performed in U-bottom 384-well plates. The final assay volume was 30 μl prepared from 15 μl additions of enzyme and substra...
Ligand InfoPC cidPC sid
In DepthDetails US Patent